Reaction Details
TargetMatrix metalloproteinase-9
LigandBDBM50069223
Substrate/Competitorn/a
Meas. Tech.ChEBML_105373
Ki 5±n/a nM
Citation Jacobson, ICReddy, PGWasserman, ZRHardman, KDCovington, MBArner, ECCopeland, RADecicco, CPMagolda, RL Structure-based design and synthesis of a series of hydroxamic acids with a quaternary-hydroxy group in P1 as inhibitors of matrix metalloproteinases. Bioorg Med Chem Lett8:837-42 (1999) Matrix metalloproteinase-9
Name:Matrix metalloproteinase-9
Type:Enzyme
Mol. Mass.:78452.28
Organism:Homo sapiens (Human)
Description:P14780
Residue:707
BDBM50069223
NameBDBM50069223
Synonyms:(2R,3R)-3-Benzyl-2,N*1*-dihydroxy-N*4*-[(S)-2-(4-methoxy-phenyl)-1-methylcarbamoyl-ethyl]-2-methyl-succinamide | CHEMBL435271
TypeSmall organic molecule
Emp. Form.C23H29N3O6
Mol. Mass.443.4929
SMILESCNC(=O)[C@H](Cc1ccc(OC)cc1)NC(=O)[C@H](Cc1ccccc1)[C@@](C)(O)C(=O)NO