Reaction Details
TargetMatrix metalloproteinase-9
LigandBDBM50069220
Substrate/Competitorn/a
Meas. Tech.ChEBML_105373
Ki 2±n/a nM
Citation Jacobson, ICReddy, PGWasserman, ZRHardman, KDCovington, MBArner, ECCopeland, RADecicco, CPMagolda, RL Structure-based design and synthesis of a series of hydroxamic acids with a quaternary-hydroxy group in P1 as inhibitors of matrix metalloproteinases. Bioorg Med Chem Lett8:837-42 (1999) Matrix metalloproteinase-9
Name:Matrix metalloproteinase-9
Type:Enzyme
Mol. Mass.:78452.28
Organism:Homo sapiens (Human)
Description:P14780
Residue:707
BDBM50069220
NameBDBM50069220
Synonyms:(2R,3R)-2,N*1*-Dihydroxy-N*4*-[(S)-2-(4-methoxy-phenyl)-1-methylcarbamoyl-ethyl]-2-methyl-3-phenethyl-succinamide | CHEMBL167278
TypeSmall organic molecule
Emp. Form.C24H31N3O6
Mol. Mass.457.5194
SMILESCNC(=O)[C@H](Cc1ccc(OC)cc1)NC(=O)[C@H](CCc1ccccc1)[C@@](C)(O)C(=O)NO