Reaction Details
TargetStromelysin-1
LigandBDBM50069227
Substrate/Competitorn/a
Meas. Tech.ChEBML_101949
Ki 25±n/a nM
Citation Jacobson, ICReddy, PGWasserman, ZRHardman, KDCovington, MBArner, ECCopeland, RADecicco, CPMagolda, RL Structure-based design and synthesis of a series of hydroxamic acids with a quaternary-hydroxy group in P1 as inhibitors of matrix metalloproteinases. Bioorg Med Chem Lett8:837-42 (1999) Stromelysin-1
Name:Stromelysin-1
Type:Enzyme
Mol. Mass.:53973.13
Organism:Homo sapiens (Human)
Description: P08254
Residue:477
BDBM50069227
NameBDBM50069227
Synonyms:(S)-2-[(R)-2-((R)-1-Hydroxy-1-hydroxycarbamoyl-ethyl)-5-phenyl-pentanoylamino]-3-phenyl-propionic acid | CHEMBL353383
TypeSmall organic molecule
Emp. Form.C23H28N2O6
Mol. Mass.428.4782
SMILESC[C@@](O)([C@@H](CCCc1ccccc1)C(=O)N[C@@H](Cc1ccccc1)C(O)=O)C(=O)NO