Reaction Details
TargetStromelysin-1
LigandBDBM50069214
Substrate/Competitorn/a
Meas. Tech.ChEBML_101949
Ki 32±n/a nM
Citation Jacobson, ICReddy, PGWasserman, ZRHardman, KDCovington, MBArner, ECCopeland, RADecicco, CPMagolda, RL Structure-based design and synthesis of a series of hydroxamic acids with a quaternary-hydroxy group in P1 as inhibitors of matrix metalloproteinases. Bioorg Med Chem Lett8:837-42 (1999) Stromelysin-1
Name:Stromelysin-1
Type:Enzyme
Mol. Mass.:53973.13
Organism:Homo sapiens (Human)
Description: P08254
Residue:477
BDBM50069214
NameBDBM50069214
Synonyms:(2R,3R)-N*4*-((S)-5-Amino-1-methylcarbamoyl-pentyl)-2,N*1*-dihydroxy-2-methyl-3-(3-phenyl-propyl)-succinamide | CHEMBL408682
TypeSmall organic molecule
Emp. Form.C21H34N4O5
Mol. Mass.422.5185
SMILESCNC(=O)[C@H](CCCCN)NC(=O)[C@H](CCCc1ccccc1)[C@@](C)(O)C(=O)NO