Reaction Details
TargetMatrix metalloproteinase-9
LigandBDBM50069214
Substrate/Competitorn/a
Meas. Tech.ChEMBL_105373 (CHEMBL712452)
Ki<1±n/a nM
Citation Jacobson, ICReddy, PGWasserman, ZRHardman, KDCovington, MBArner, ECCopeland, RADecicco, CPMagolda, RL Structure-based design and synthesis of a series of hydroxamic acids with a quaternary-hydroxy group in P1 as inhibitors of matrix metalloproteinases. Bioorg Med Chem Lett8:837-42 (1999) Matrix metalloproteinase-9
Name:Matrix metalloproteinase-9
Type:Enzyme
Mol. Mass.:78452.28
Organism:Homo sapiens (Human)
Description:P14780
Residue:707
BDBM50069214
NameBDBM50069214
Synonyms:(2R,3R)-N*4*-((S)-5-Amino-1-methylcarbamoyl-pentyl)-2,N*1*-dihydroxy-2-methyl-3-(3-phenyl-propyl)-succinamide | CHEMBL408682
TypeSmall organic molecule
Emp. Form.C21H34N4O5
Mol. Mass.422.5185
SMILESCNC(=O)[C@H](CCCCN)NC(=O)[C@H](CCCc1ccccc1)[C@@](C)(O)C(=O)NO