Reaction Details
TargetAcetylcholinesterase
LigandBDBM50069243
Substrate/Competitorn/a
Meas. Tech.ChEMBL_28152 (CHEMBL644107)
IC50>100000±n/a nM
Citation Perola, ECellai, LBrufani, M Synthesis and activity studies of N-[omega-N'-(adamant-1'-yl)aminoalkyl]- 2-(4'-dimethylaminophenyl)acetamides: in the search of selective inhibitors for the different molecular forms of acetylcholinesterase. Bioorg Med Chem Lett8:575-80 (1999) Acetylcholinesterase
Name:Acetylcholinesterase
Type:Enzyme
Mol. Mass.:67792.70
Organism:Homo sapiens (Human)
Description:P22303
Residue:614
BDBM50069243
NameBDBM50069243
Synonyms:CHEMBL153934 | N-[10-(Adamantan-1-ylamino)-decyl]-2-(4-dimethylamino-phenyl)-acetamide
TypeSmall organic molecule
Emp. Form.C30H49N3O
Mol. Mass.467.7296
SMILESCN(C)c1ccc(CC(=O)NCCCCCCCCCCNC23CC4CC(CC(C4)C2)C3)cc1