Reaction Details
TargetAcetylcholinesterase
LigandBDBM50069244
Substrate/Competitorn/a
Meas. Tech.ChEMBL_27807 (CHEMBL636517)
IC50>100000±n/a nM
Citation Perola, ECellai, LBrufani, M Synthesis and activity studies of N-[omega-N'-(adamant-1'-yl)aminoalkyl]- 2-(4'-dimethylaminophenyl)acetamides: in the search of selective inhibitors for the different molecular forms of acetylcholinesterase. Bioorg Med Chem Lett8:575-80 (1999) Acetylcholinesterase
Name:Acetylcholinesterase
Type:Enzyme
Mol. Mass.:67659.62
Organism:Bos taurus (bovine)
Description:n/a
Residue:613
BDBM50069244
NameBDBM50069244
Synonyms:CHEMBL357551 | N-[8-(Adamantan-1-ylamino)-octyl]-2-(4-dimethylamino-phenyl)-acetamide
TypeSmall organic molecule
Emp. Form.C28H45N3O
Mol. Mass.439.6764
SMILESCN(C)c1ccc(CC(=O)NCCCCCCCCNC23CC4CC(CC(C4)C2)C3)cc1