Reaction Details
TargetAcetylcholinesterase
LigandBDBM50069245
Substrate/Competitorn/a
Meas. Tech.ChEMBL_27808 (CHEMBL636518)
IC50 19000±n/a nM
Citation Perola, ECellai, LBrufani, M Synthesis and activity studies of N-[omega-N'-(adamant-1'-yl)aminoalkyl]- 2-(4'-dimethylaminophenyl)acetamides: in the search of selective inhibitors for the different molecular forms of acetylcholinesterase. Bioorg Med Chem Lett8:575-80 (1999) Acetylcholinesterase
Name:Acetylcholinesterase
Type:Enzyme
Mol. Mass.:67659.62
Organism:Bos taurus (bovine)
Description:n/a
Residue:613
BDBM50069245
NameBDBM50069245
Synonyms:CHEMBL157336 | N-[12-(Adamantan-1-ylamino)-dodecyl]-2-(4-dimethylamino-phenyl)-acetamide
TypeSmall organic molecule
Emp. Form.C32H53N3O
Mol. Mass.495.7827
SMILESCN(C)c1ccc(CC(=O)NCCCCCCCCCCCCNC23CC4CC(CC(C4)C2)C3)cc1