Reaction Details
Target5-hydroxytryptamine receptor 1D
LigandBDBM50069315
Substrate/Competitorn/a
Meas. Tech.ChEBML_1727
Ki 0.890000±n/a nM
Citation Perez, MPauwels, PJFourrier, CChopin, PValentin, JPJohn, GWMarien, MHalazy, S Dimerization of sumatriptan as an efficient way to design a potent, centrally and orally active 5-HT1B agonist. Bioorg Med Chem Lett8:675-80 (1999) 5-hydroxytryptamine receptor 1D
Name:5-hydroxytryptamine receptor 1D
Type:G Protein-Coupled Receptor (GPCR)
Mol. Mass.:41920.63
Organism:Homo sapiens (Human)
Description:Receptor binding assays were performed using human clone stably expressed in CHO cells.
Residue:377
BDBM50069315
NameBDBM50069315
Synonyms:C-[3-(2-Dimethylamino-ethyl)-1H-indol-5-yl]-N-[4-({[3-(2-dimethylamino-ethyl)-1H-indol-5-ylmethanesulfonyl]-methyl-amino}-methyl)-benzyl]-N-methyl-methanesulfonamide | CHEMBL158941
TypeSmall organic molecule
Emp. Form.C36H48N6O4S2
Mol. Mass.692.934
SMILESCN(C)CCc1c[nH]c2ccc(CS(=O)(=O)N(C)Cc3ccc(CN(C)S(=O)(=O)Cc4ccc5[nH]cc(CCN(C)C)c5c4)cc3)cc12