Reaction Details
TargetNeuropeptide Y receptor type 1
LigandBDBM50069415
Substrate/Competitorn/a
Meas. Tech.ChEMBL_144140 (CHEMBL750755)
Ki 52.0±n/a nM
Citation Zimmerman, DMCantrell, BESmith, ECNixon, JABruns, RFGitter, BHipskind, PAOrnstein, PLZarrinmayeh, HBritton, TCSchober, DAGehlert, DR Structure-activity relationships of a series of 1-substituted-4-methylbenzimidazole neuropeptide Y-1 receptor antagonists. Bioorg Med Chem Lett8:473-6 (1999) Neuropeptide Y receptor type 1
Name:Neuropeptide Y receptor type 1
Type:Enzyme Catalytic Domain
Mol. Mass.:44399.07
Organism:Homo sapiens (Human)
Description:NPY-Y1 NPY1R HUMAN::P25929
Residue:384
BDBM50069415
NameBDBM50069415
Synonyms:2-(4-Chloro-phenoxymethyl)-4-methyl-1-{3-[1-(4-piperidin-1-yl-butyl)-piperidin-4-yl]-propyl}-1H-benzoimidazole | CHEMBL433734
TypeSmall organic molecule
Emp. Form.C32H45ClN4O
Mol. Mass.537.179
SMILESCc1cccc2n(CCCC3CCN(CCCCN4CCCCC4)CC3)c(COc3ccc(Cl)cc3)nc12