Reaction Details
TargetNeuropeptide Y receptor type 1
LigandBDBM50069423
Substrate/Competitorn/a
Meas. Tech.ChEBML_144140
Ki 21±n/a nM
Citation Zimmerman, DMCantrell, BESmith, ECNixon, JABruns, RFGitter, BHipskind, PAOrnstein, PLZarrinmayeh, HBritton, TCSchober, DAGehlert, DR Structure-activity relationships of a series of 1-substituted-4-methylbenzimidazole neuropeptide Y-1 receptor antagonists. Bioorg Med Chem Lett8:473-6 (1999) Neuropeptide Y receptor type 1
Name:Neuropeptide Y receptor type 1
Type:Enzyme Catalytic Domain
Mol. Mass.:44399.07
Organism:Homo sapiens (Human)
Description:NPY-Y1 NPY1R HUMAN::P25929
Residue:384
BDBM50069423
NameBDBM50069423
Synonyms:4-(4-{3-[2-(4-Chloro-phenoxymethyl)-4-methyl-benzoimidazol-1-yl]-propyl}-piperidin-1-yl)-1-piperidin-1-yl-butan-1-one | CHEMBL145396
TypeSmall organic molecule
Emp. Form.C32H43ClN4O2
Mol. Mass.551.162
SMILESCc1cccc2n(CCCC3CCN(CCCC(=O)N4CCCCC4)CC3)c(COc3ccc(Cl)cc3)nc12