Reaction Details
TargetNeuropeptide Y receptor type 1
LigandBDBM50065468
Substrate/Competitorn/a
Meas. Tech.ChEMBL_143840 (CHEMBL747051)
Ki 2±n/a nM
Citation Zimmerman, DMCantrell, BESmith, ECNixon, JABruns, RFGitter, BHipskind, PAOrnstein, PLZarrinmayeh, HBritton, TCSchober, DAGehlert, DR Structure-activity relationships of a series of 1-substituted-4-methylbenzimidazole neuropeptide Y-1 receptor antagonists. Bioorg Med Chem Lett8:473-6 (1999) Neuropeptide Y receptor type 1
Name:Neuropeptide Y receptor type 1
Type:Enzyme Catalytic Domain
Mol. Mass.:44399.07
Organism:Homo sapiens (Human)
Description:NPY-Y1 NPY1R HUMAN::P25929
Residue:384
BDBM50065468
NameBDBM50065468
Synonyms:2-(4-Chloro-phenoxymethyl)-4-(3-piperidin-1-yl-propoxy)-1-(3-piperidin-3-yl-propyl)-1H-benzoimidazole | CHEMBL61532
TypeSmall organic molecule
Emp. Form.C30H41ClN4O2
Mol. Mass.525.125
SMILESClc1ccc(OCc2nc3c(OCCCN4CCCCC4)cccc3n2CCCC2CCCNC2)cc1