Reaction Details
TargetNeuropeptide Y receptor type 1
LigandBDBM50069427
Substrate/Competitorn/a
Meas. Tech.ChEBML_144140
Ki 29±n/a nM
Citation Zimmerman, DMCantrell, BESmith, ECNixon, JABruns, RFGitter, BHipskind, PAOrnstein, PLZarrinmayeh, HBritton, TCSchober, DAGehlert, DR Structure-activity relationships of a series of 1-substituted-4-methylbenzimidazole neuropeptide Y-1 receptor antagonists. Bioorg Med Chem Lett8:473-6 (1999) Neuropeptide Y receptor type 1
Name:Neuropeptide Y receptor type 1
Type:Enzyme Catalytic Domain
Mol. Mass.:44399.07
Organism:Homo sapiens (Human)
Description:NPY-Y1 NPY1R HUMAN::P25929
Residue:384
BDBM50069427
NameBDBM50069427
Synonyms:2-(4-Chloro-phenoxymethyl)-4-methyl-1-[3-(1-propyl-piperidin-4-yl)-propyl]-1H-benzoimidazole | CHEMBL145761
TypeSmall organic molecule
Emp. Form.C26H34ClN3O
Mol. Mass.440.021
SMILESCCCN1CCC(CCCn2c(COc3ccc(Cl)cc3)nc3c(C)cccc23)CC1