Reaction Details
TargetMu-type opioid receptor
LigandBDBM50069562
Substrate/Competitorn/a
Meas. Tech.ChEMBL_138747 (CHEMBL747920)
Ki 1.3±n/a nM
Citation Li, GHaq, WXiang, LLou, BSHughes, RDe Leon, IADavis, PGillespie, TJRomanowski, MZhu, XMisicka, ALipkowski, AWPorreca, FDavis, TPYamamura, HIO'Brien, DFHruby, VJ Modifications of the 4,4'-residues and SAR studies of Biphalin, a highly potent opioid receptor active peptide. Bioorg Med Chem Lett8:555-60 (1999) Mu-type opioid receptor
Name:Mu-type opioid receptor
Type:Enzyme Catalytic Domain
Mol. Mass.:11165.58
Organism:GUINEA PIG
Description:P97266
Residue:98
BDBM50069562
NameBDBM50069562
Synonyms:2-Amino-N-((S)-1-{[((R)-1-{N'-[(R)-2-(2-{(S)-2-[2-amino-3-(4-hydroxy-phenyl)-propionylamino]-propionylamino}-acetylamino)-3-phenyl-butyryl]-hydrazinocarbonyl}-2-phenyl-propylcarbamoyl)-methyl]-carbamoyl}-ethyl)-3-(4-hydroxy-phenyl)-propionamide | CHEMBL2371082
TypeSmall organic molecule
Emp. Form.C48H60N10O10
Mol. Mass.937.051
SMILESC[C@@H](NC(=O)[C@@H](N)Cc1ccc(O)cc1)C(=O)NCC(=O)N[C@@H]([C@H](C)c1ccccc1)C(=O)NNC(=O)[C@@H](NC(=O)CNC(=O)[C@@H](C)NC(=O)[C@@H](N)Cc1ccc(O)cc1)[C@H](C)c1ccccc1