Reaction Details
TargetEndothelin-1 receptor
LigandBDBM50034267
Substrate/Competitorn/a
Meas. Tech.ChEBML_63362
IC50 0.440000±n/a nM
Citation Mederski, WWOsswald, MDorsch, DAnzali, SChristadler, MSchmitges, CJWilm, C Endothelin antagonists: evaluation of 2,1,3-benzothiadiazole as a methylendioxyphenyl bioisoster. Bioorg Med Chem Lett8:17-22 (1999) Endothelin-1 receptor
Name:Endothelin-1 receptor
Type:Enzyme Catalytic Domain
Mol. Mass.:48256.91
Organism:RAT
Description:ENDOTHELIN A EDNRA RAT::P26684
Residue:426
BDBM50034267
NameBDBM50034267
Synonyms:3-(benzo[d][1,3]dioxol-5-yl)-5-hydroxy-5-(4-methoxyphenyl)-4-(3,4,5-trimethoxybenzyl)furan-2(5H)-one CHEMBL8981 PD156707
TypeSmall organic molecule
Emp. Form.C28H26O9
Mol. Mass.506.5006
SMILESCOc1ccc(cc1)C1(O)OC(=O)C(=C1Cc1cc(OC)c(OC)c(OC)c1)c1ccc2OCOc2c1