Reaction Details
TargetLow affinity immunoglobulin epsilon Fc receptor
LigandBDBM50069587
Substrate/Competitorn/a
Meas. Tech.ChEBML_41676
IC50>1000±n/a nM
Citation Bailey, SBolognese, BBuckle, DRFaller, AJackson, SLouis-Flamberg, PMcCord, MMayer, RJMarshall, LASmith, DG Hydroxamate-based inhibitors of low affinity IgE receptor (CD23) processing. Bioorg Med Chem Lett8:23-8 (1999) Low affinity immunoglobulin epsilon Fc receptor
Name:Low affinity immunoglobulin epsilon Fc receptor
Type:PROTEIN
Mol. Mass.:36461.84
Organism:Homo sapiens (Human)
Description:ChEMBL_88888
Residue:321
BDBM50069587
NameBDBM50069587
Synonyms:(R)-N*1*-((S)-1-Benzylcarbamoyl-2-phenyl-ethyl)-N*4*-hydroxy-2-naphthalen-2-ylmethyl-succinamide | CHEMBL92762
TypeSmall organic molecule
Emp. Form.C31H31N3O4
Mol. Mass.509.5955
SMILESONC(=O)C[C@@H](Cc1ccc2ccccc2c1)C(=O)N[C@@H](Cc1ccccc1)C(=O)NCc1ccccc1