Reaction Details
TargetLow affinity immunoglobulin epsilon Fc receptor
LigandBDBM50069583
Substrate/Competitorn/a
Meas. Tech.ChEBML_41676
IC50 200±n/a nM
Citation Bailey, SBolognese, BBuckle, DRFaller, AJackson, SLouis-Flamberg, PMcCord, MMayer, RJMarshall, LASmith, DG Hydroxamate-based inhibitors of low affinity IgE receptor (CD23) processing. Bioorg Med Chem Lett8:23-8 (1999) Low affinity immunoglobulin epsilon Fc receptor
Name:Low affinity immunoglobulin epsilon Fc receptor
Type:PROTEIN
Mol. Mass.:36461.84
Organism:Homo sapiens (Human)
Description:ChEMBL_88888
Residue:321
BDBM50069583
NameBDBM50069583
Synonyms:(R)-N*1*-((S)-1-Benzylcarbamoyl-2-phenyl-ethyl)-2-cyclopentylmethyl-N*4*-hydroxy-succinamide | CHEMBL420077
TypeSmall organic molecule
Emp. Form.C26H33N3O4
Mol. Mass.451.5579
SMILESONC(=O)C[C@@H](CC1CCCC1)C(=O)N[C@@H](Cc1ccccc1)C(=O)NCc1ccccc1