Reaction Details
TargetLow affinity immunoglobulin epsilon Fc receptor
LigandBDBM50069608
Substrate/Competitorn/a
Meas. Tech.ChEMBL_41675 (CHEMBL655818)
IC50 40±n/a nM
Citation Bailey, SBolognese, BBuckle, DRFaller, AJackson, SLouis-Flamberg, PMcCord, MMayer, RJMarshall, LASmith, DG Selective inhibition of low affinity IgE receptor (CD23) processing. Bioorg Med Chem Lett8:29-34 (1999) Low affinity immunoglobulin epsilon Fc receptor
Name:Low affinity immunoglobulin epsilon Fc receptor
Type:PROTEIN
Mol. Mass.:36461.84
Organism:Homo sapiens (Human)
Description:ChEMBL_88888
Residue:321
BDBM50069608
NameBDBM50069608
Synonyms:(2R,3S)-N*4*-Hydroxy-2-isobutyl-N*1*-((S)-1-methylcarbamoyl-2-phenyl-ethyl)-3-phenylsulfanylmethyl-succinamide GW-9471
TypeSmall organic molecule
Emp. Form.C25H33N3O4S
Mol. Mass.471.612
SMILESCNC(=O)[C@H](Cc1ccccc1)NC(=O)[C@H](CC(C)C)[C@H](CSc1ccccc1)C(=O)NO