Reaction Details
TargetLow affinity immunoglobulin epsilon Fc receptor
LigandBDBM50069582
Substrate/Competitorn/a
Meas. Tech.ChEBML_41669
IC50 1900±n/a nM
Citation Bailey, SBolognese, BBuckle, DRFaller, AJackson, SLouis-Flamberg, PMcCord, MMayer, RJMarshall, LASmith, DG Selective inhibition of low affinity IgE receptor (CD23) processing. Bioorg Med Chem Lett8:29-34 (1999) Low affinity immunoglobulin epsilon Fc receptor
Name:Low affinity immunoglobulin epsilon Fc receptor
Type:PROTEIN
Mol. Mass.:36461.84
Organism:Homo sapiens (Human)
Description:ChEMBL_88888
Residue:321
BDBM50069582
NameBDBM50069582
Synonyms:(R)-N*1*-((S)-1-Benzylcarbamoyl-2-phenyl-ethyl)-N*4*-hydroxy-2-isobutyl-succinamide | CHEMBL96654
TypeSmall organic molecule
Emp. Form.C24H31N3O4
Mol. Mass.425.5206
SMILESCC(C)C[C@H](CC(=O)NO)C(=O)N[C@@H](Cc1ccccc1)C(=O)NCc1ccccc1