Reaction Details
TargetKynureninase
LigandBDBM50069730
Substrate/Competitorn/a
Meas. Tech.ChEMBL_91725 (CHEMBL702023)
IC50 36000±n/a nM
Citation Drysdale, MJReinhard, JF S-aryl cysteine S,S-dioxides as inhibitors of mammalian kynureninase. Bioorg Med Chem Lett8:133-8 (1999) Kynureninase
Name:Kynureninase
Type:PROTEIN
Mol. Mass.:52470.50
Organism:Rattus norvegicus
Description:ChEMBL_91725
Residue:464
BDBM50069730
NameBDBM50069730
Synonyms:2-Amino-3-(2-amino-benzenesulfonyl)-propionic acid | CHEMBL280572
TypeSmall organic molecule
Emp. Form.C9H12N2O4S
Mol. Mass.244.268
SMILESNC(CS(=O)(=O)c1ccccc1N)C(O)=O