Reaction Details
TargetHistamine H3 receptor
LigandBDBM50069825
Substrate/Competitorn/a
Meas. Tech.ChEBML_85846
Ki 2±n/a nM
Citation Shih, NYAslanian, RLupo, ATOrlando, SPiwinski, JJGreen, MJGanguly, AKWest, RTozzi, SKreutner, WHey, JA Trans-4-methyl-3-imidazoyl pyrrolidine as a potent, highly selective histamine H3 receptor agonist in vivo. Bioorg Med Chem Lett8:243-8 (1999) Histamine H3 receptor
Name:Histamine H3 receptor
Type:Enzyme Catalytic Domain
Mol. Mass.:48753.61
Organism:GUINEA PIG
Description:HISTAMINE H3 HRH3 GUINEA PIG::Q9JI35
Residue:445
BDBM50069825
NameBDBM50069825
Synonyms:4-Pyrrolidin-3-yl-1H-imidazole | CHEMBL79983
TypeSmall organic molecule
Emp. Form.C7H11N3
Mol. Mass.137.1823
SMILESC1CC(CN1)c1cnc[nH]1