Reaction Details
TargetHistamine H1 receptor
LigandBDBM22904
Substrate/Competitorn/a
Meas. Tech.ChEBML_83922
Ki>10000±n/a nM
Citation Shih, NYAslanian, RLupo, ATOrlando, SPiwinski, JJGreen, MJGanguly, AKWest, RTozzi, SKreutner, WHey, JA Trans-4-methyl-3-imidazoyl pyrrolidine as a potent, highly selective histamine H3 receptor agonist in vivo. Bioorg Med Chem Lett8:243-8 (1999) Histamine H1 receptor
Name:Histamine H1 receptor
Type:G Protein-Coupled Receptor (GPCR)
Mol. Mass.:55641.53
Organism:Cavia porcellus (domestic guinea pig)
Description:Guinea pig cerebellum was used in binding assay.
Residue:488
BDBM22904
NameBDBM22904
Synonyms:(2R)-1-(1H-imidazol-5-yl)propan-2-amine Alpha-Methylhistamine-R CHEMBL268229 RAMH
TypeSmall organic molecule
Emp. Form.C6H11N3
Mol. Mass.125.1716
SMILESC[C@@H](N)Cc1cnc[nH]1