Reaction Details
TargetHistamine H3 receptor
LigandBDBM22904
Substrate/Competitorn/a
Meas. Tech.ChEMBL_85846 (CHEMBL693573)
Ki 1.5±n/a nM
Citation Shih, NYAslanian, RLupo, ATOrlando, SPiwinski, JJGreen, MJGanguly, AKWest, RTozzi, SKreutner, WHey, JA Trans-4-methyl-3-imidazoyl pyrrolidine as a potent, highly selective histamine H3 receptor agonist in vivo. Bioorg Med Chem Lett8:243-8 (1999) Histamine H3 receptor
Name:Histamine H3 receptor
Type:Enzyme Catalytic Domain
Mol. Mass.:48753.61
Organism:GUINEA PIG
Description:HISTAMINE H3 HRH3 GUINEA PIG::Q9JI35
Residue:445
BDBM22904
NameBDBM22904
Synonyms:(2R)-1-(1H-imidazol-5-yl)propan-2-amine Alpha-Methylhistamine-R CHEMBL268229 RAMH
TypeSmall organic molecule
Emp. Form.C6H11N3
Mol. Mass.125.1716
SMILESC[C@@H](N)Cc1cnc[nH]1