Reaction Details
TargetCoagulation factor X
LigandBDBM50069931
Substrate/Competitorn/a
Meas. Tech.ChEBML_69662
Ki 320±n/a nM
Citation Fevig, JMBuriak, JCacciola, JAlexander, RSKettner, CAKnabb, RMPruitt, JRWeber, PCWexler, RR Rational design of boropeptide thrombin inhibitors: beta, beta-dialkyl-phenethylglycine P2 analogs of DuP 714 with greater selectivity over complement factor I and an improved safety profile. Bioorg Med Chem Lett8:301-6 (1999) Coagulation factor X
Name:Coagulation factor X
Type:Enzyme
Mol. Mass.:54726.60
Organism:Homo sapiens (Human)
Description:n/a
Residue:488
BDBM50069931
NameBDBM50069931
Synonyms:Boropeptide analogue | CHEMBL105212
TypeSmall organic molecule
Emp. Form.C26H38BN3O4
Mol. Mass.467.409
SMILESCC(C)(CN(CC(=O)NC(CCCCN)B(O)O)C(=O)CCc1ccccc1)c1ccccc1