Reaction Details
TargetCoagulation factor X
LigandBDBM50069929
Substrate/Competitorn/a
Meas. Tech.ChEBML_69662
Ki 392±n/a nM
Citation Fevig, JMBuriak, JCacciola, JAlexander, RSKettner, CAKnabb, RMPruitt, JRWeber, PCWexler, RR Rational design of boropeptide thrombin inhibitors: beta, beta-dialkyl-phenethylglycine P2 analogs of DuP 714 with greater selectivity over complement factor I and an improved safety profile. Bioorg Med Chem Lett8:301-6 (1999) Coagulation factor X
Name:Coagulation factor X
Type:Enzyme
Mol. Mass.:54726.60
Organism:Homo sapiens (Human)
Description:n/a
Residue:488
BDBM50069929
NameBDBM50069929
Synonyms:Boropeptide analogue | CHEMBL103078
TypeSmall organic molecule
Emp. Form.C28H41BN4O4
Mol. Mass.508.461
SMILESCc1cc(C)cc(c1)C(C)(C)CN(CC(=O)NC(CCCNC=N)B(O)O)C(=O)CCc1ccccc1