Reaction Details
TargetCoagulation factor X
LigandBDBM50069935
Substrate/Competitorn/a
Meas. Tech.ChEBML_69662
Ki 62±n/a nM
Citation Fevig, JMBuriak, JCacciola, JAlexander, RSKettner, CAKnabb, RMPruitt, JRWeber, PCWexler, RR Rational design of boropeptide thrombin inhibitors: beta, beta-dialkyl-phenethylglycine P2 analogs of DuP 714 with greater selectivity over complement factor I and an improved safety profile. Bioorg Med Chem Lett8:301-6 (1999) Coagulation factor X
Name:Coagulation factor X
Type:Enzyme
Mol. Mass.:54726.60
Organism:Homo sapiens (Human)
Description:n/a
Residue:488
BDBM50069935
NameBDBM50069935
Synonyms:Boropeptide analogue | CHEMBL320213
TypeSmall organic molecule
Emp. Form.C28H42BN5O4
Mol. Mass.523.475
SMILESCc1cc(C)cc(c1)C(C)(C)CN(CC(=O)NC(CCCNC(N)=N)B(O)O)C(=O)CCc1ccccc1