Reaction Details
TargetProthrombin
LigandBDBM50069934
Substrate/Competitorn/a
Meas. Tech.ChEBML_208314
Ki 2.4±n/a nM
Citation Fevig, JMBuriak, JCacciola, JAlexander, RSKettner, CAKnabb, RMPruitt, JRWeber, PCWexler, RR Rational design of boropeptide thrombin inhibitors: beta, beta-dialkyl-phenethylglycine P2 analogs of DuP 714 with greater selectivity over complement factor I and an improved safety profile. Bioorg Med Chem Lett8:301-6 (1999) Prothrombin
Name:Prothrombin
Type:Protein
Mol. Mass.:70029.57
Organism:Homo sapiens (Human)
Description:P00734
Residue:622
BDBM50069934
NameBDBM50069934
Synonyms:Boropeptide analogue | CHEMBL431056
TypeSmall organic molecule
Emp. Form.C28H40BN3O4
Mol. Mass.493.446
SMILESNCCCCC(NC(=O)CN(CC1(CCCC1)c1ccccc1)C(=O)CCc1ccccc1)B(O)O