Reaction Details
TargetProthrombin
LigandBDBM50069932
Substrate/Competitorn/a
Meas. Tech.ChEBML_208314
Ki 0.890000±n/a nM
Citation Fevig, JMBuriak, JCacciola, JAlexander, RSKettner, CAKnabb, RMPruitt, JRWeber, PCWexler, RR Rational design of boropeptide thrombin inhibitors: beta, beta-dialkyl-phenethylglycine P2 analogs of DuP 714 with greater selectivity over complement factor I and an improved safety profile. Bioorg Med Chem Lett8:301-6 (1999) Prothrombin
Name:Prothrombin
Type:Protein
Mol. Mass.:70029.57
Organism:Homo sapiens (Human)
Description:P00734
Residue:622
BDBM50069932
NameBDBM50069932
Synonyms:Boropeptide analogue | CHEMBL105393
TypeSmall organic molecule
Emp. Form.C24H33BN4O4
Mol. Mass.452.354
SMILESOB(O)C(CCCNC=N)NC(=O)CN(CCc1ccccc1)C(=O)CCc1ccccc1