Reaction Details
TargetDihydroorotate dehydrogenase (quinone), mitochondrial
LigandBDBM50069948
Substrate/Competitorn/a
Meas. Tech.ChEBML_52889
Ki 25±n/a nM
Citation Pitts, WJJetter, JWPinto, DJOrwat, MJBatt, DGSherk, SRPetraitis, JJJacobson, ICCopeland, RADowling, RLJaffee, BDGardner, TLJones, EAMagolda, RL Structure-activity relationships (SAR) of some tetracyclic heterocycles related to the immunosuppressive agent Brequinar Sodium. Bioorg Med Chem Lett8:307-12 (1999) Dihydroorotate dehydrogenase (quinone), mitochondrial
Name:Dihydroorotate dehydrogenase (quinone), mitochondrial
Type:Enzyme
Mol. Mass.:42881.33
Organism:Homo sapiens (Human)
Description:Q02127
Residue:395
BDBM50069948
NameBDBM50069948
Synonyms:CHEMBL107209 | Sodium; 9-fluoro-3-(3-methoxy-phenyl)-5,6-dihydro-benzo[c]acridine-7-carboxylate
TypeSmall organic molecule
Emp. Form.C25H17FNO3
Mol. Mass.398.4063
SMILESCOc1cccc(c1)-c1ccc-2c(CCc3c-2nc2ccc(F)cc2c3C([O-])=O)c1