Reaction Details
TargetRhizopuspepsin
LigandBDBM50070006
Substrate/Competitorn/a
Meas. Tech.ChEBML_197492
Ki 336±n/a nM
Citation Ripka, ASBohacek, RSRich, DH Synthesis of novel cyclic protease inhibitors using Grubbs olefin metathesis. Bioorg Med Chem Lett8:357-60 (1999) Rhizopuspepsin
Name:Rhizopuspepsin
Type:PROTEIN
Mol. Mass.:41326.43
Organism:Rhizopus microsporus var. chinensis
Description:ChEMBL_100244
Residue:393
BDBM50070006
NameBDBM50070006
Synonyms:((Z)-(3R,6R,15R)-15-Hydroxymethyl-3-isopropyl-2,5-dioxo-1,4diaza-cyclopentadec-10-en-6-yl)-carbamic acid tert-butyl ester | CHEMBL332531
TypeSmall organic molecule
Emp. Form.C22H39N3O5
Mol. Mass.425.5622
SMILESCC(C)[C@H]1NC(=O)[C@@H](CCC\C=C/CCC[C@H](CO)NC1=O)NC(=O)OC(C)(C)C