Reaction Details
TargetCyclin-dependent kinase 1/G2/mitotic-specific cyclin-B1/G2/mitotic-specific cyclin-B2/G2/mitotic-specific cyclin-B3
LigandBDBM50070091
Substrate/Competitorn/a
Meas. Tech.ChEMBL_48867 (CHEMBL661323)
IC50>1000000±n/a nM
Citation Sasaki, SHashimoto, TObana, NYasuda, HUehara, YMaeda, M Design of new inhibitors for cdc2 kinase based on a multiple pseudosubstrate structure. Bioorg Med Chem Lett8:1019-22 (1999) Cyclin-dependent kinase 1/G2/mitotic-specific cyclin-B1/G2/mitotic-specific cyclin-B2/G2/mitotic-specific cyclin-B3
Name:Cyclin-dependent kinase 1/G2/mitotic-specific cyclin-B1/G2/mitotic-specific cyclin-B2/G2/mitotic-specific cyclin-B3
Type:n/a
Mol. Mass.:n/a
Description:ASSAY_ID of EBI is 40085
Components:This complex has 4 components.
Component 1
Name:G2/mitotic-specific cyclin-B3
Synonyms:CCNB3 CYCB3 G2/mitotic-specific cyclin-B3
Type:PROTEIN
Mol. Mass.:157916.84
Organism:Homo sapiens (Human)
Description:n/a
Residue:1395
Component 2
Name:G2/mitotic-specific cyclin-B1
Synonyms:CCNB CCNB1_HUMAN
Type:Enzyme Subunit
Mol. Mass.:48340.95
Organism:Homo sapiens (Human)
Description:P14635
Residue:433
Component 3
Name:G2/mitotic-specific cyclin-B2
Synonyms:CCNB2 Cyclin-dependent kinase 1/cyclin B | G2/mitotic-specific cyclin-B2
Type:PROTEIN
Mol. Mass.:45293.13
Organism:Homo sapiens (Human)
Description:n/a
Residue:398
Component 4
Name:Cyclin-dependent kinase 1
Synonyms:CDC2 CDK1 CDKN1 Cell division protein kinase 1 P34CDC2 | p34 protein kinase
Type:Enzyme Subunit
Mol. Mass.:34101.08
Organism:Homo sapiens (Human)
Description:P06493
Residue:297
BDBM50070091
NameBDBM50070091
Synonyms:3,4-bis(indol-3-yl)maleimide derivative | CHEMBL426521
TypeSmall organic molecule
Emp. Form.C54H77N11O9S
Mol. Mass.1056.322
SMILESCNC(=O)[C@H](CCCCN)NC(=O)[C@H](CCCCN)NC(=O)[C@@H]1CCCN1C(=O)[C@H](CSCCOCCOCCn1cc(C2=C(C(=O)NC2=O)c2cn(CCCN(C)C)c3ccccc23)c2ccccc12)NC(C)=O