Reaction Details
TargetBeta-2 adrenergic receptor
LigandBDBM50070149
Substrate/Competitorn/a
Meas. Tech.ChEBML_38316
IC50 10±n/a nM
Citation Weber, AEMathvink, RJPerkins, LHutchins, JECandelore, MRTota, LStrader, CDWyvratt, MJFisher, MH Potent, selective benzenesulfonamide agonists of the human beta 3 adrenergic receptor. Bioorg Med Chem Lett8:1101-6 (1999) Beta-2 adrenergic receptor
Name:Beta-2 adrenergic receptor
Type:n/a
Mol. Mass.:46461.69
Organism:Homo sapiens (Human)
Description:P07550
Residue:413
BDBM50070149
NameBDBM50070149
Synonyms:4-((3S)-3-{[(2S)-2-hydroxy-3-(4-hydroxyphenoxy)propyl]amino}butyl)phenol | CHEMBL12994
TypeSmall organic molecule
Emp. Form.C19H25NO4
Mol. Mass.331.4061
SMILESC[C@@H](CCc1ccc(O)cc1)NC[C@H](O)COc1ccc(O)cc1