Reaction Details
TargetBeta-2 adrenergic receptor
LigandBDBM50070127
Substrate/Competitorn/a
Meas. Tech.ChEBML_38316
IC50 500±n/a nM
Citation Weber, AEMathvink, RJPerkins, LHutchins, JECandelore, MRTota, LStrader, CDWyvratt, MJFisher, MH Potent, selective benzenesulfonamide agonists of the human beta 3 adrenergic receptor. Bioorg Med Chem Lett8:1101-6 (1999) Beta-2 adrenergic receptor
Name:Beta-2 adrenergic receptor
Type:n/a
Mol. Mass.:46461.69
Organism:Homo sapiens (Human)
Description:P07550
Residue:413
BDBM50070127
NameBDBM50070127
Synonyms:4-{(S)-3-[2-(4-Amino-phenyl)-ethylamino]-2-hydroxy-propoxy}-phenol | CHEMBL13034
TypeSmall organic molecule
Emp. Form.C17H22N2O3
Mol. Mass.302.3682
SMILESNc1ccc(CCNC[C@H](O)COc2ccc(O)cc2)cc1