Reaction Details
TargetBeta-2 adrenergic receptor
LigandBDBM50070134
Substrate/Competitorn/a
Meas. Tech.ChEMBL_38293 (CHEMBL647097)
EC50<0.1±n/a nM
CommentsZero 20220115
Citation Weber, AEMathvink, RJPerkins, LHutchins, JECandelore, MRTota, LStrader, CDWyvratt, MJFisher, MH Potent, selective benzenesulfonamide agonists of the human beta 3 adrenergic receptor. Bioorg Med Chem Lett8:1101-6 (1999) Beta-2 adrenergic receptor
Name:Beta-2 adrenergic receptor
Type:n/a
Mol. Mass.:46461.69
Organism:Homo sapiens (Human)
Description:P07550
Residue:413
BDBM50070134
NameBDBM50070134
Synonyms:4-{(R)-2-Hydroxy-3-[(S)-3-(4-methoxy-phenyl)-1-methyl-propylamino]-propoxy}-phenol | CHEMBL12949
TypeSmall organic molecule
Emp. Form.C20H27NO4
Mol. Mass.345.4327
SMILESCOc1ccc(CC[C@H](C)NC[C@@H](O)COc2ccc(O)cc2)cc1