Reaction Details
TargetBeta-2 adrenergic receptor
LigandBDBM50070145
Substrate/Competitorn/a
Meas. Tech.ChEBML_38316
IC50 220±n/a nM
Citation Weber, AEMathvink, RJPerkins, LHutchins, JECandelore, MRTota, LStrader, CDWyvratt, MJFisher, MH Potent, selective benzenesulfonamide agonists of the human beta 3 adrenergic receptor. Bioorg Med Chem Lett8:1101-6 (1999) Beta-2 adrenergic receptor
Name:Beta-2 adrenergic receptor
Type:n/a
Mol. Mass.:46461.69
Organism:Homo sapiens (Human)
Description:P07550
Residue:413
BDBM50070145
NameBDBM50070145
Synonyms:CHEMBL12188 | N-(4-{2-[(S)-2-Hydroxy-3-(4-hydroxy-phenoxy)-propylamino]-ethyl}-phenyl)-methanesulfonamide
TypeSmall organic molecule
Emp. Form.C18H24N2O5S
Mol. Mass.380.459
SMILESCS(=O)(=O)Nc1ccc(CCNC[C@H](O)COc2ccc(O)cc2)cc1