Reaction Details
TargetBeta-2 adrenergic receptor
LigandBDBM50070126
Substrate/Competitorn/a
Meas. Tech.ChEBML_38316
IC50 370±n/a nM
Citation Weber, AEMathvink, RJPerkins, LHutchins, JECandelore, MRTota, LStrader, CDWyvratt, MJFisher, MH Potent, selective benzenesulfonamide agonists of the human beta 3 adrenergic receptor. Bioorg Med Chem Lett8:1101-6 (1999) Beta-2 adrenergic receptor
Name:Beta-2 adrenergic receptor
Type:n/a
Mol. Mass.:46461.69
Organism:Homo sapiens (Human)
Description:P07550
Residue:413
BDBM50070126
NameBDBM50070126
Synonyms:3-Chloro-N-(4-{2-[(S)-2-hydroxy-3-(4-hydroxy-phenoxy)-propylamino]-ethyl}-phenyl)-benzenesulfonamide | CHEMBL12813
TypeSmall organic molecule
Emp. Form.C23H25ClN2O5S
Mol. Mass.476.973
SMILESO[C@@H](CNCCc1ccc(NS(=O)(=O)c2cccc(Cl)c2)cc1)COc1ccc(O)cc1