Reaction Details
TargetBeta-2 adrenergic receptor
LigandBDBM50070125
Substrate/Competitorn/a
Meas. Tech.ChEBML_38316
IC50 230±n/a nM
Citation Weber, AEMathvink, RJPerkins, LHutchins, JECandelore, MRTota, LStrader, CDWyvratt, MJFisher, MH Potent, selective benzenesulfonamide agonists of the human beta 3 adrenergic receptor. Bioorg Med Chem Lett8:1101-6 (1999) Beta-2 adrenergic receptor
Name:Beta-2 adrenergic receptor
Type:n/a
Mol. Mass.:46461.69
Organism:Homo sapiens (Human)
Description:P07550
Residue:413
BDBM50070125
NameBDBM50070125
Synonyms:CHEMBL276659 | N-(4-{2-[(S)-2-Hydroxy-3-(4-hydroxy-phenoxy)-propylamino]-ethyl}-phenyl)-benzamide
TypeSmall organic molecule
Emp. Form.C24H26N2O4
Mol. Mass.406.4742
SMILESO[C@@H](CNCCc1ccc(NC(=O)c2ccccc2)cc1)COc1ccc(O)cc1