Reaction Details
TargetBeta-1 adrenergic receptor
LigandBDBM50070155
Substrate/Competitorn/a
Meas. Tech.ChEBML_37241
IC50 1000±n/a nM
Citation Weber, AEMathvink, RJPerkins, LHutchins, JECandelore, MRTota, LStrader, CDWyvratt, MJFisher, MH Potent, selective benzenesulfonamide agonists of the human beta 3 adrenergic receptor. Bioorg Med Chem Lett8:1101-6 (1999) Beta-1 adrenergic receptor
Name:Beta-1 adrenergic receptor
Type:G Protein-Coupled Receptor (GPCR)
Mol. Mass.:51338.40
Organism:Homo sapiens (Human)
Description:P08588
Residue:477
BDBM50070155
NameBDBM50070155
Synonyms:3-Phenyl-propane-1-sulfonic acid (4-{2-[(S)-2-hydroxy-3-(4-hydroxy-phenoxy)-propylamino]-ethyl}-phenyl)-amide | CHEMBL13003
TypeSmall organic molecule
Emp. Form.C26H32N2O5S
Mol. Mass.484.608
SMILESO[C@@H](CNCCc1ccc(NS(=O)(=O)CCCc2ccccc2)cc1)COc1ccc(O)cc1