Reaction Details
TargetBeta-1 adrenergic receptor
LigandBDBM50070132
Substrate/Competitorn/a
Meas. Tech.ChEBML_37241
IC50 180±n/a nM
Citation Weber, AEMathvink, RJPerkins, LHutchins, JECandelore, MRTota, LStrader, CDWyvratt, MJFisher, MH Potent, selective benzenesulfonamide agonists of the human beta 3 adrenergic receptor. Bioorg Med Chem Lett8:1101-6 (1999) Beta-1 adrenergic receptor
Name:Beta-1 adrenergic receptor
Type:G Protein-Coupled Receptor (GPCR)
Mol. Mass.:51338.40
Organism:Homo sapiens (Human)
Description:P08588
Residue:477
BDBM50070132
NameBDBM50070132
Synonyms:(S)-N-(4-(2-(2-hydroxy-3-(4-hydroxyphenoxy)propylamino)ethyl)phenyl)benzenesulfonamide N-(4-{2-[(S)-2-Hydroxy-3-(4-hydroxy-phenoxy)-propylamino]-ethyl}-phenyl)-benzenesulfonamide
TypeSmall organic molecule
Emp. Form.C23H26N2O5S
Mol. Mass.442.528
SMILESO[C@@H](CNCCc1ccc(NS(=O)(=O)c2ccccc2)cc1)COc1ccc(O)cc1