Reaction Details
TargetAlpha-2A adrenergic receptor [16-465]/Alpha-2B adrenergic receptor/Alpha-2C adrenergic receptor
LigandBDBM50070193
Substrate/Competitorn/a
Meas. Tech.ChEMBL_33925 (CHEMBL884021)
IC50 7±n/a nM
Citation Mantegani, SBrambilla, ECaccia, CDamiani, GFornaretto, MGMcArthur, RAVarasi, M Serotonergic ergoline derivatives. Bioorg Med Chem Lett8:1117-22 (1999) Alpha-2A adrenergic receptor [16-465]/Alpha-2B adrenergic receptor/Alpha-2C adrenergic receptor
Name:Alpha-2A adrenergic receptor [16-465]/Alpha-2B adrenergic receptor/Alpha-2C adrenergic receptor
Synonyms:Adrenergic receptor alpha-2
Type:n/a
Mol. Mass.:n/a
Description:ASSAY_ID of ChEMBL is 935397
Components:This complex has 3 components.
Component 1
Name:Alpha-2C adrenergic receptor
Type:Enzyme Catalytic Domain
Mol. Mass.:49890.50
Organism:RAT
Description:adrenergic Alpha2 0 RAT::P22086
Residue:458
Component 2
Name:Alpha-2B adrenergic receptor
Synonyms:ADA2B_RAT Adrenergic receptor alpha Alpha-2B adrenergic receptor Alpha-2B adrenoreceptor | adrenergic Alpha2B
Type:Enzyme Catalytic Domain
Mol. Mass.:50379.83
Organism:NEONATAL RAT
Description:adrenergic Alpha2B ADRA2B NEONATAL RAT::P19328
Residue:453
Component 3
Name:Alpha-2A adrenergic receptor [16-465]
Synonyms:ADA2A_RAT Adrenaline 2 Alpha-2A adrenoceptor Alpha-2AAR Alpha2 Adrenoreceptor adrenergic Alpha2A
Type:G-protein coupled receptor
Mol. Mass.:48961.69
Organism:Rattus norvegicus (rat)
Description:P22909[16-465]
Residue:450
BDBM50070193
NameBDBM50070193
Synonyms:1-((6aR,9R,10aR)-2-tert-Butyl-7-methyl-4,6,6a,7,8,9,10,10a-octahydro-indolo[4,3-fg]quinoline-9-carbonyl)-1-(3-dimethylamino-propyl)-3-ethyl-urea | CHEMBL276013
TypeSmall organic molecule
Emp. Form.C28H43N5O2
Mol. Mass.481.6733
SMILESCCNC(=O)N(CCCN(C)C)C(=O)[C@@H]1C[C@H]2[C@@H](Cc3c[nH]c4cc(cc2c34)C(C)(C)C)N(C)C1