Reaction Details
TargetMatrix metalloproteinase-9
LigandBDBM50070247
Substrate/Competitorn/a
Meas. Tech.ChEBML_105234
IC50 1.4±n/a nM
Citation Campbell, DAXiao, XYHarris, DIda, SMortezaei, RNgu, KShi, LTien, DWang, YNavre, MPatel, DVSharr, MADiJoseph, JFKillar, LMLeone, CLLevin, JISkotnicki, JS Malonyl alpha-mercaptoketones and alpha-mercaptoalcohols, a new class of matrix metalloproteinase inhibitors. Bioorg Med Chem Lett8:1157-62 (1999) Matrix metalloproteinase-9
Name:Matrix metalloproteinase-9
Type:Enzyme
Mol. Mass.:78452.28
Organism:Homo sapiens (Human)
Description:P14780
Residue:707
BDBM50070247
NameBDBM50070247
Synonyms:2-(2-Mercapto-acetyl)-nonanoic acid ((S)-2-cyclohexyl-1-phenethylcarbamoyl-ethyl)-amide | CHEMBL278050
TypeSmall organic molecule
Emp. Form.C28H44N2O3S
Mol. Mass.488.726
SMILESCCCCCCCC(C(=O)CS)C(=O)N[C@@H](CC1CCCCC1)C(=O)NCCc1ccccc1