Reaction Details
TargetStromelysin-1
LigandBDBM50070224
Substrate/Competitorn/a
Meas. Tech.ChEBML_104711
IC50 120±n/a nM
Citation Campbell, DAXiao, XYHarris, DIda, SMortezaei, RNgu, KShi, LTien, DWang, YNavre, MPatel, DVSharr, MADiJoseph, JFKillar, LMLeone, CLLevin, JISkotnicki, JS Malonyl alpha-mercaptoketones and alpha-mercaptoalcohols, a new class of matrix metalloproteinase inhibitors. Bioorg Med Chem Lett8:1157-62 (1999) Stromelysin-1
Name:Stromelysin-1
Type:Enzyme
Mol. Mass.:53973.13
Organism:Homo sapiens (Human)
Description: P08254
Residue:477
BDBM50070224
NameBDBM50070224
Synonyms:2-(1-Hydroxy-2-mercapto-ethyl)-nonanoic acid {(S)-2,2-dimethyl-1-[2-(4-sulfamoyl-phenyl)-ethylcarbamoyl]-propyl}-amide | CHEMBL16172
TypeSmall organic molecule
Emp. Form.C25H43N3O5S2
Mol. Mass.529.756
SMILESCCCCCCCC(C(O)CS)C(=O)N[C@H](C(=O)NCCc1ccc(cc1)S(N)(=O)=O)C(C)(C)C