Reaction Details
TargetStromelysin-1
LigandBDBM50070249
Substrate/Competitorn/a
Meas. Tech.ChEBML_104711
IC50 98±n/a nM
Citation Campbell, DAXiao, XYHarris, DIda, SMortezaei, RNgu, KShi, LTien, DWang, YNavre, MPatel, DVSharr, MADiJoseph, JFKillar, LMLeone, CLLevin, JISkotnicki, JS Malonyl alpha-mercaptoketones and alpha-mercaptoalcohols, a new class of matrix metalloproteinase inhibitors. Bioorg Med Chem Lett8:1157-62 (1999) Stromelysin-1
Name:Stromelysin-1
Type:Enzyme
Mol. Mass.:53973.13
Organism:Homo sapiens (Human)
Description: P08254
Residue:477
BDBM50070249
NameBDBM50070249
Synonyms:2-(2-Mercapto-acetyl)-4-methyl-pentanoic acid ((S)-2-cyclohexyl-1-phenethylcarbamoyl-ethyl)-amide | CHEMBL278452
TypeSmall organic molecule
Emp. Form.C25H38N2O3S
Mol. Mass.446.646
SMILESCC(C)CC(C(=O)CS)C(=O)N[C@@H](CC1CCCCC1)C(=O)NCCc1ccccc1