Reaction Details
TargetMatrix metalloproteinase-9
LigandBDBM50063920
Substrate/Competitorn/a
Meas. Tech.ChEBML_105236
IC50 12±n/a nM
Citation Levin, JIDiJoseph, JFKillar, LMSharr, MASkotnicki, JSPatel, DVXiao, XYShi, LNavre, MCampbell, DA The asymmetric synthesis and in vitro characterization of succinyl mercaptoalcohol and mercaptoketone inhibitors of matrix metalloproteinases. Bioorg Med Chem Lett8:1163-8 (1999) Matrix metalloproteinase-9
Name:Matrix metalloproteinase-9
Type:Enzyme
Mol. Mass.:78452.28
Organism:Homo sapiens (Human)
Description:P14780
Residue:707
BDBM50063920
NameBDBM50063920
Synonyms:(R)-N*1*-((S)-2,2-Dimethyl-1-methylcarbamoyl-propyl)-N*4*-hydroxy-2-isobutyl-succinamide CHEMBL16520 | Ro-31-9790
TypeSmall organic molecule
Emp. Form.C15H29N3O4
Mol. Mass.315.4085
SMILESCNC(=O)[C@@H](NC(=O)[C@H](CC(C)C)CC(=O)NO)C(C)(C)C