Reaction Details
TargetInterstitial collagenase
LigandBDBM50070457
Substrate/Competitorn/a
Meas. Tech.ChEBML_105954
IC50 1.3±n/a nM
Citation Curtin, MLGarland, RBDavidsen, SKMarcotte, PAAlbert, DHMagoc, TJHutchins, C Broad spectrum matrix metalloproteinase inhibitors: an examination of succinamide hydroxamate inhibitors with P1 C alpha gem-disubstitution. Bioorg Med Chem Lett8:1443-8 (1999) Interstitial collagenase
Name:Interstitial collagenase
Type:Enzyme
Mol. Mass.:54010.26
Organism:Homo sapiens (Human)
Description: P03956
Residue:469
BDBM50070457
NameBDBM50070457
Synonyms:(2R,3S)-N*4*-Hydroxy-2-isobutyl-3-methyl-N*1*-((S)-1-methylcarbamoyl-2-phenyl-ethyl)-succinamide | CHEMBL32730
TypeSmall organic molecule
Emp. Form.C19H29N3O4
Mol. Mass.363.4513
SMILESCNC(=O)[C@H](Cc1ccccc1)NC(=O)[C@H](CC(C)C)[C@H](C)C(=O)NO