Reaction Details
TargetAcetylcholinesterase
LigandBDBM50070473
Substrate/Competitorn/a
Meas. Tech.ChEBML_27994
Ki 5±n/a nM
Citation Lee, BHPark, MBYu, BS Inhibition of electric eel acetylcholinesterase by porphin compounds. Bioorg Med Chem Lett8:1467-70 (1999) Acetylcholinesterase
Name:Acetylcholinesterase
Type:Enzyme
Mol. Mass.:71812.79
Organism:Electrophorus electricus (Electric eel)
Description:n/a
Residue:633
BDBM50070473
NameBDBM50070473
Synonyms:(1Z,4Z,9Z,15Z)-5,10,15,20-Tetrakis-(2,4-difluoro-phenyl)-porphyrin | CHEMBL286018
TypeSmall organic molecule
Emp. Form.C44H22F8N4
Mol. Mass.758.6595
SMILESFc1ccc(c(F)c1)-c1c2ccc(n2)c(-c2ccc(F)cc2F)c2ccc([nH]2)c(-c2ccc(F)cc2F)c2ccc([nH]2)c(-c2ccc(F)cc2F)c2ccc1n2