Reaction Details
TargetAcetylcholinesterase
LigandBDBM50070476
Substrate/Competitorn/a
Meas. Tech.ChEBML_27994
Ki 12±n/a nM
Citation Lee, BHPark, MBYu, BS Inhibition of electric eel acetylcholinesterase by porphin compounds. Bioorg Med Chem Lett8:1467-70 (1999) Acetylcholinesterase
Name:Acetylcholinesterase
Type:Enzyme
Mol. Mass.:71812.79
Organism:Electrophorus electricus (Electric eel)
Description:n/a
Residue:633
BDBM50070476
NameBDBM50070476
Synonyms:(1Z,4Z,9Z,15Z)-5,10,15,20-Tetrakis-(2,6-difluoro-phenyl)-porphyrin | CHEMBL284754
TypeSmall organic molecule
Emp. Form.C44H22F8N4
Mol. Mass.758.6595
SMILESFc1cccc(F)c1-c1c2ccc(n2)c(-c2c(F)cccc2F)c2ccc([nH]2)c(-c2c(F)cccc2F)c2ccc([nH]2)c(-c2c(F)cccc2F)c2ccc1n2