Reaction Details
Target5-hydroxytryptamine receptor 2A
LigandBDBM50070518
Substrate/Competitorn/a
Meas. Tech.ChEBML_2244
Ki 36±n/a nM
Citation Belliotti, TRBrink, WAKesten, SRRubin, JRWustrow, DJZoski, KTWhetzel, SZCorbin, AEPugsley, TAHeffner, TGWise, LD Isoindolinone enantiomers having affinity for the dopamine D4 receptor. Bioorg Med Chem Lett8:1499-502 (1999) 5-hydroxytryptamine receptor 2A
Name:5-hydroxytryptamine receptor 2A
Type:Enzyme Catalytic Domain
Mol. Mass.:52578.24
Organism:BOVINE
Description:5-HT2A HTR2A BOVINE::Q75Z89
Residue:470
BDBM50070518
NameBDBM50070518
Synonyms:(R)-3-{2-[4-(3,4-Dimethyl-phenyl)-piperazin-1-yl]-ethyl}-2,3-dihydro-isoindol-1-one PD-172939
TypeSmall organic molecule
Emp. Form.C22H27N3O
Mol. Mass.349.4693
SMILESCc1ccc(cc1C)N1CCN(CC[C@H]2NC(=O)c3ccccc23)CC1