Reaction Details
TargetReverse transcriptase/RNaseH
LigandBDBM1317
Substrate/Competitorn/a
Meas. Tech.ChEMBL_196516 (CHEMBL798330)
IC50 1600±n/a nM
Citation Sahlberg, CNoréen, REngelhardt, PHögberg, MKangasmetsä, JVrang, LZhang, H Synthesis and anti-HIV activities of urea-PETT analogs belonging to a new class of potent non-nucleoside HIV-1 reverse transcriptase inhibitors. Bioorg Med Chem Lett8:1511-6 (1999) Reverse transcriptase/RNaseH
Name:Reverse transcriptase/RNaseH
Type:PROTEIN
Mol. Mass.:65229.15
Organism:Human immunodeficiency virus 1
Description:ChEMBL_1473730
Residue:566
BDBM1317
NameBDBM1317
Synonyms:3-[[(4,7-Dichlorobenzoxazol-2-yl)-methyl]amino]-5-ethyl-6-methylpyridin-2(1H)-one CHEMBL268871 Pyridinone deriv.
TypeSmall organic molecule
Emp. Form.C16H15Cl2N3O2
Mol. Mass.352.215
SMILESCCc1cc(NCc2nc3c(Cl)ccc(Cl)c3o2)c(=O)[nH]c1C