Reaction Details
TargetReverse transcriptase/RNaseH
LigandBDBM50070535
Substrate/Competitorn/a
Meas. Tech.ChEMBL_196517 (CHEMBL798331)
IC50 20±n/a nM
Citation Sahlberg, CNoréen, REngelhardt, PHögberg, MKangasmetsä, JVrang, LZhang, H Synthesis and anti-HIV activities of urea-PETT analogs belonging to a new class of potent non-nucleoside HIV-1 reverse transcriptase inhibitors. Bioorg Med Chem Lett8:1511-6 (1999) Reverse transcriptase/RNaseH
Name:Reverse transcriptase/RNaseH
Type:PROTEIN
Mol. Mass.:65229.15
Organism:Human immunodeficiency virus 1
Description:ChEMBL_1473730
Residue:566
BDBM50070535
NameBDBM50070535
Synonyms:1-[(1R,2R)-2-(6-Chloro-3-ethoxy-2-fluoro-phenyl)-cyclopropyl]-3-(5-chloro-pyridin-2-yl)-urea | CHEMBL37835
TypeSmall organic molecule
Emp. Form.C17H16Cl2FN3O2
Mol. Mass.384.232
SMILESCCOc1ccc(Cl)c([C@H]2C[C@H]2NC(=O)Nc2ccc(Cl)cn2)c1F